BDBM465366 US10793566, Compound 5
SMILES COc1cccc(Oc2ccc(cc2)-c2nn([C@@H]3CCN(C3)C(=O)C=C)c3c(C)cncc23)c1F
InChI Key InChIKey=CMPFDAJTBOPCNS-LJQANCHMSA-N
Data  1 IC50
  Tab Delimited (TSV)   2D SDfile   Computed 3D by Vconf -m prep SDfile
Find this compound or compounds like it in BindingDB:
Activity Spreadsheet -- Enzyme Inhibition Constant Data from BindingDB
Found 1 hit for monomerid = 465366
TargetTyrosine-protein kinase BTK(Homo sapiens (Human))
Zibo Biopolar Changsheng Pharmaceutical
US Patent
LigandPNGBDBM465366(US10793566, Compound 5)
Affinity DataIC50: <10nM. Assay description: Btk kinase activity was determined using a homogenous time resolved fluorescence (HTRF) methodology. Measurements were performed in a reaction volume...
Ligand InfoPC cidPC sid
In DepthDetails US Patent