BDBM46538 1-(2-methyl-3-pyrazolyl)-3-[4-(trifluoromethoxy)phenyl]urea::1-(2-methylpyrazol-3-yl)-3-[4-(trifluoromethoxy)phenyl]urea::1-(2-methylpyrazol-3-yl)-3-[4-(trifluoromethyloxy)phenyl]urea::MLS001111226::N-(1-methyl-1H-pyrazol-5-yl)-N'-[4-(trifluoromethoxy)phenyl]urea::SMR000457986::cid_2808863
SMILES Cn1nccc1NC(=O)Nc1ccc(OC(F)(F)F)cc1
InChI Key InChIKey=AEYHODPQCVJHNO-UHFFFAOYSA-N
Data  2 EC50
  Tab Delimited (TSV)   2D SDfile   Computed 3D by Vconf -m prep SDfile
Find this compound or compounds like it in BindingDB:
Activity Spreadsheet -- Enzyme Inhibition Constant Data from BindingDB
Found 2 hits for monomerid = 46538
TargetEukaryotic translation initiation factor 2-alpha kinase 3(Homo sapiens (Human))
The Scripps Research Institute Molecular Screening Center
Curated by PubChem BioAssay
LigandPNGBDBM46538(1-(2-methyl-3-pyrazolyl)-3-[4-(trifluoromethoxy)ph...)
Affinity DataEC50: >5.57E+4nM. Assay description: Source (MLPCN Center Name): The Scripps Research Institute Molecular Screening Center (SRIMSC) Center Affiliation: The Scripps Research Institute (TS...
In DepthDetails PCBioAssay
TargetEukaryotic translation initiation factor 2-alpha kinase 3(Homo sapiens (Human))
The Scripps Research Institute Molecular Screening Center
Curated by PubChem BioAssay
LigandPNGBDBM46538(1-(2-methyl-3-pyrazolyl)-3-[4-(trifluoromethoxy)ph...)
Affinity DataEC50: >5.57E+4nM. Assay description: Source (MLPCN Center Name): The Scripps Research Institute Molecular Screening Center (SRIMSC) Center Affiliation: The Scripps Research Institute (TS...
In DepthDetails PCBioAssay