BDBM465396 US10793568, Compound I-15
SMILES OC(=O)c1cc(c2nc(sc2c1)N1C[C@@H]2C[C@H]1C[C@H]2OCc1c(onc1-c1c(Cl)cccc1Cl)C1CC1)C(F)(F)F
InChI Key InChIKey=CLTULJJYPQTSKL-AUSJPIAWSA-N
Data  1 EC50
  Tab Delimited (TSV)   2D SDfile   Computed 3D by Vconf -m prep SDfile
Find this compound or compounds like it in BindingDB:
Activity Spreadsheet -- Enzyme Inhibition Constant Data from BindingDB
Found 1 hit for monomerid = 465396
TargetBile acid receptor(Homo sapiens (Human))
Ardelyx
US Patent
LigandPNGBDBM465396(US10793568, Compound I-15)
Affinity DataEC50:  15.8nM. Assay description: The affinity of FXR ligands for the ligand binding domain of FXR was determined using a commercially available human FXR ligand binding assay (Lantha...
Ligand InfoPC cidPC sid
In DepthDetails US Patent