BDBM465415 US10793568, Compound I-34
SMILES OC(=O)c1cc(F)c2nc(sc2c1)N1C[C@@H]2C[C@H]1C[C@@H]2OC(=O)c1c(onc1-c1c(Cl)cccc1Cl)C1CC1
InChI Key InChIKey=KNIOVRXWVHSXFJ-DEYYWGMASA-N
Data  1 EC50
  Tab Delimited (TSV)   2D SDfile   Computed 3D by Vconf -m prep SDfile
Find this compound or compounds like it in BindingDB:
Activity Spreadsheet -- Enzyme Inhibition Constant Data from BindingDB
Found 1 hit for monomerid = 465415
TargetBile acid receptor(Homo sapiens (Human))
Ardelyx
US Patent
LigandPNGBDBM465415(US10793568, Compound I-34)
Affinity DataEC50: >3.16E+4nM. Assay description: The affinity of FXR ligands for the ligand binding domain of FXR was determined using a commercially available human FXR ligand binding assay (Lantha...
Ligand InfoPC cidPC sid
In DepthDetails US Patent