BDBM46568 (2Z)-7-chloranyl-2-[(2E)-1-chloranyl-2-(3-chloranyl-6-oxidanylidene-cyclohexa-2,4-dien-1-ylidene)ethylidene]-1H-quinazolin-4-one::(2Z)-7-chloro-2-[(2E)-1-chloro-2-(3-chloro-6-keto-cyclohexa-2,4-dien-1-ylidene)ethylidene]-1H-quinazolin-4-one::(2Z)-7-chloro-2-[(2E)-1-chloro-2-(3-chloro-6-oxo-1-cyclohexa-2,4-dienylidene)ethylidene]-1H-quinazolin-4-one::(2Z)-7-chloro-2-[(2E)-1-chloro-2-(3-chloro-6-oxocyclohexa-2,4-dien-1-ylidene)ethylidene]-1H-quinazolin-4-one::MLS000394715::SMR000242822::cid_15945307
SMILES Oc1ccc(Cl)cc1C=C(Cl)c1nc2cc(Cl)ccc2c(=O)[nH]1
InChI Key InChIKey=FDEKBBCTVHRYLB-UHFFFAOYSA-N
Data  4 IC50
  Tab Delimited (TSV)   2D SDfile   Computed 3D by Vconf -m prep SDfile
Find this compound or compounds like it in BindingDB:
Activity Spreadsheet -- Enzyme Inhibition Constant Data from BindingDB
Found 4 hits for monomerid = 46568
TargetTransitional endoplasmic reticulum ATPase(Homo sapiens (Human))
The Scripps Research Institute Molecular Screening Center
Curated by PubChem BioAssay
LigandPNGBDBM46568((2Z)-7-chloranyl-2-[(2E)-1-chloranyl-2-(3-chlorany...)
Affinity DataIC50: >5.00E+4nM. Assay description: Source (MLPCN Center Name): The Scripps Research Institute Molecular Screening Center Center Affiliation: The Scripps Research Institute (TSRI) Assay...
Ligand InfoPC cidPC sid
In DepthDetails PCBioAssay
TargetSentrin-specific protease 1(Homo sapiens (Human))
Burnham Center For Chemical Genomics
Curated by PubChem BioAssay
LigandPNGBDBM46568((2Z)-7-chloranyl-2-[(2E)-1-chloranyl-2-(3-chlorany...)
Affinity DataIC50:  654nM
Ligand InfoPC cidPC sid
In DepthDetails PCBioAssay
TargetSentrin-specific protease 1(Homo sapiens (Human))
Burnham Center For Chemical Genomics
Curated by PubChem BioAssay
LigandPNGBDBM46568((2Z)-7-chloranyl-2-[(2E)-1-chloranyl-2-(3-chlorany...)
Affinity DataIC50:  428nM
Ligand InfoPC cidPC sid
In DepthDetails PCBioAssay
TargetTransitional endoplasmic reticulum ATPase(Homo sapiens (Human))
The Scripps Research Institute Molecular Screening Center
Curated by PubChem BioAssay
LigandPNGBDBM46568((2Z)-7-chloranyl-2-[(2E)-1-chloranyl-2-(3-chlorany...)
Affinity DataIC50: >5.00E+4nM. Assay description: Source (MLPCN Center Name): The Scripps Research Institute Molecular Screening Center Center Affiliation: The Scripps Research Institute (TSRI) Assay...
Ligand InfoPC cidPC sid
In DepthDetails PCBioAssay