BDBM465695 US10793568, Compound I-346
SMILES O[C@@H]1CCC[C@H]1S(=O)(=O)NC(=O)c1ccc(cc1F)N1[C@@H]2C[C@@H](OCc3c(onc3-c3c(Cl)cccc3Cl)C3CC3)[C@@H](C2)C1=O
InChI Key InChIKey=AJHOKKJPPSMIBB-KYZSUZRRSA-N
Data  1 EC50
  Tab Delimited (TSV)   2D SDfile   Computed 3D by Vconf -m prep SDfile
Find this compound or compounds like it in BindingDB:
Activity Spreadsheet -- Enzyme Inhibition Constant Data from BindingDB
Found 1 hit for monomerid = 465695
TargetBile acid receptor(Homo sapiens (Human))
Ardelyx
US Patent
LigandPNGBDBM465695(US10793568, Compound I-346)
Affinity DataEC50:  6.31nM. Assay description: The affinity of FXR ligands for the ligand binding domain of FXR was determined using a commercially available human FXR ligand binding assay (Lantha...
Ligand InfoPC cidPC sid
In DepthDetails US Patent