BDBM465739 2-{3-[2-amino-6-(2-methoxyphenyl)- 7H-pyrrolo[2,3-d]pyrimidin-4-yl]- 2-(hydroxymethyl)phenyl}-6-cyclopropyl- 8-fluoroisoquinolin-1(2H)-one::US10793575, Example 14
SMILES COc1ccccc1-c1cc2c(nc(N)nc2[nH]1)-c1cccc(c1CO)-n1ccc2cc(cc(F)c2c1=O)C1CC1
InChI Key InChIKey=AZYVPNZFSRNPKG-UHFFFAOYSA-N
Data  1 IC50
  Tab Delimited (TSV)   2D SDfile   Computed 3D by Vconf -m prep SDfile
Find this compound or compounds like it in BindingDB:
Activity Spreadsheet -- Enzyme Inhibition Constant Data from BindingDB
Found 1 hit for monomerid = 465739
TargetTyrosine-protein kinase BTK(Homo sapiens (Human))
Carna Biosciences
US Patent
LigandPNGBDBM465739(2-{3-[2-amino-6-(2-methoxyphenyl)- 7H-pyrrolo[2,3-...)
Affinity DataIC50: <10nM. Assay description: The kinase activity was measured using QuickScout Screening Assist (trade mark) MSA (commercially available kit manufactured by Carna Biosciences, In...
Ligand InfoPC cidPC sid
In DepthDetails US Patent