BDBM465753 2-[3-(2-amino-5- phenyl-7H- pyrrolo[2,3-d]pyrimidin- 4-yl)-2-(hydroxy- methyl)phenyl]-6- cyclopropyl- 8-fluoroisoquinolin- 1(2H)-one::US10793575, Example 28
SMILES Nc1nc(-c2cccc(c2CO)-n2ccc3cc(cc(F)c3c2=O)C2CC2)c2c(c[nH]c2n1)-c1ccccc1
InChI Key InChIKey=XCSYFSGVJVBOAZ-UHFFFAOYSA-N
Data  1 IC50
  Tab Delimited (TSV)   2D SDfile   Computed 3D by Vconf -m prep SDfile
Find this compound or compounds like it in BindingDB:
Activity Spreadsheet -- Enzyme Inhibition Constant Data from BindingDB
Found 1 hit for monomerid = 465753
TargetTyrosine-protein kinase BTK(Homo sapiens (Human))
Carna Biosciences
US Patent
LigandPNGBDBM465753(2-[3-(2-amino-5- phenyl-7H- pyrrolo[2,3-d]pyrimidi...)
Affinity DataIC50: <10nM. Assay description: The kinase activity was measured using QuickScout Screening Assist (trade mark) MSA (commercially available kit manufactured by Carna Biosciences, In...
Ligand InfoPC cidPC sid
In DepthDetails US Patent