BDBM46578 (6Z)-5-imino-3-(isobutylsulfonyl)-6-[(2-methyl-1H-indol-3-yl)methylene]-5,6-dihydro-7H-[1,2,4]thiadiazolo[4,5-a]pyrimidin-7-one::5-amino-3-isobutylsulfonyl-6-[(Z)-(2-methylindol-3-ylidene)methyl]-[1,2,4]thiadiazolo[4,5-a]pyrimidin-7-one::5-amino-6-[(Z)-(2-methyl-3-indolylidene)methyl]-3-(2-methylpropylsulfonyl)-[1,2,4]thiadiazolo[4,5-a]pyrimidin-7-one::5-amino-6-[(Z)-(2-methylindol-3-ylidene)methyl]-3-(2-methylpropylsulfonyl)-[1,2,4]thiadiazolo[4,5-a]pyrimidin-7-one::5-azanyl-6-[(Z)-(2-methylindol-3-ylidene)methyl]-3-(2-methylpropylsulfonyl)-[1,2,4]thiadiazolo[4,5-a]pyrimidin-7-one::MLS000730743::SMR000309118::cid_16194309
SMILES CC(C)CS(=O)(=O)c1nsc2nc(=O)c(\C=C3/C(C)=Nc4ccccc34)c(N)n12
InChI Key InChIKey=MQXMPZRFCWUBTI-MDWZMJQESA-N
Data  4 IC50  1 EC50
  Tab Delimited (TSV)   2D SDfile   Computed 3D by Vconf -m prep SDfile
Find this compound or compounds like it in BindingDB:
Activity Spreadsheet -- Enzyme Inhibition Constant Data from BindingDB
Found 5 hits for monomerid = 46578
TargetTransitional endoplasmic reticulum ATPase(Homo sapiens (Human))
The Scripps Research Institute Molecular Screening Center
Curated by PubChem BioAssay
LigandPNGBDBM46578((6Z)-5-imino-3-(isobutylsulfonyl)-6-[(2-methyl-1H-...)
Affinity DataIC50: >5.00E+4nM. Assay description: Source (MLPCN Center Name): The Scripps Research Institute Molecular Screening Center Center Affiliation: The Scripps Research Institute (TSRI) Assay...
In DepthDetails PCBioAssay
TargetTransitional endoplasmic reticulum ATPase(Homo sapiens (Human))
The Scripps Research Institute Molecular Screening Center
Curated by PubChem BioAssay
LigandPNGBDBM46578((6Z)-5-imino-3-(isobutylsulfonyl)-6-[(2-methyl-1H-...)
Affinity DataIC50:  1.23E+4nM. Assay description: Source (MLPCN Center Name): The Scripps Research Institute Molecular Screening Center Center Affiliation: The Scripps Research Institute (TSRI) Assay...
In DepthDetails PCBioAssay
TargetCorticotropin-releasing factor-binding protein(Homo sapiens (Human))
Burnham Center For Chemical Genomics
Curated by PubChem BioAssay
LigandPNGBDBM46578((6Z)-5-imino-3-(isobutylsulfonyl)-6-[(2-methyl-1H-...)
Affinity DataIC50:  2.00E+4nM
In DepthDetails PCBioAssay
TargetCorticotropin-releasing factor-binding protein(Homo sapiens (Human))
Burnham Center For Chemical Genomics
Curated by PubChem BioAssay
LigandPNGBDBM46578((6Z)-5-imino-3-(isobutylsulfonyl)-6-[(2-methyl-1H-...)
Affinity DataEC50: >5.30E+4nM. Assay description: Data Source: Sanford-Burnham Center for Chemical Genomics (SBCCG) Source Affiliation: Sanford-Burnham Medical Research Institute (SBMRI, San Diego, C...
In DepthDetails PCBioAssay
TargetM1 family aminopeptidase(Plasmodium falciparum (isolate FcB1 / Columbia))
Srmlsc
Curated by PubChem BioAssay
LigandPNGBDBM46578((6Z)-5-imino-3-(isobutylsulfonyl)-6-[(2-methyl-1H-...)
Affinity DataIC50:  2.95E+4nM. Assay description: Southern Research Molecular Libraries Screening Center (SRMLSC) Southern Research Institute (Birmingham, Alabama) NIH Molecular Libraries Screening...
In DepthDetails PCBioAssay