BDBM465791 US10793576, Example 23
SMILES CC#CC(=O)N1[C@@H]2CC[C@@H](C2)C1c1nc(-c2ccc(cc2)C(=O)Nc2ccccn2)c2c(N)nccn12
InChI Key InChIKey=CCZCQRYWZOBLHF-ZPVKFHTISA-N
Data  1 IC50
  Tab Delimited (TSV)   2D SDfile   Computed 3D by Vconf -m prep SDfile
Find this compound or compounds like it in BindingDB:
Activity Spreadsheet -- Enzyme Inhibition Constant Data from BindingDB
Found 1 hit for monomerid = 465791
TargetTyrosine-protein kinase BTK(Homo sapiens (Human))
Chengdu Brilliant Pharmaceutical
US Patent
LigandPNGBDBM465791(US10793576, Example 23)
Affinity DataIC50:  49nM. Assay description: 1: Test Principle:Mobility-Shift Assay, which is microfluidic chip technology, applies the basic concept of capillary electrophoresis to microfluidic...
Ligand InfoPC cidPC sid
In DepthDetails US Patent