BDBM465796 US10793576, Example 28
SMILES Nc1nccn2c(nc(-c3ccc(cc3)C(=O)Nc3ccccn3)c12)C12CC3CC(CC(C3)(C1)NC(=O)C=C)C2
InChI Key InChIKey=KZVXWZPINYVBHM-UHFFFAOYSA-N
Data  1 IC50
  Tab Delimited (TSV)   2D SDfile   Computed 3D by Vconf -m prep SDfile
Find this compound or compounds like it in BindingDB:
Activity Spreadsheet -- Enzyme Inhibition Constant Data from BindingDB
Found 1 hit for monomerid = 465796
TargetTyrosine-protein kinase BTK(Homo sapiens (Human))
Chengdu Brilliant Pharmaceutical
US Patent
LigandPNGBDBM465796(US10793576, Example 28)
Affinity DataIC50:  124nM. Assay description: 1: Test Principle:Mobility-Shift Assay, which is microfluidic chip technology, applies the basic concept of capillary electrophoresis to microfluidic...
Ligand InfoPC cidPC sid
In DepthDetails US Patent