BDBM465808 (S)-4-(8-amino-3-(5-(but-2-ynoyl)-5-azaspiro[2.4]heptan-6-yl)imidazo[1,5-a]pyrazin-1-yl 1)-N-(4-(trifluoromethyl) pyridin-2-yl)benzamide::US10793576, Example 40
SMILES CC#CC(=O)N1CC2(CC2)CC1c1nc(-c2ccc(cc2)C(=O)Nc2cc(ccn2)C(F)(F)F)c2c(N)nccn12
InChI Key InChIKey=SJLOYRMFVLDSPD-UHFFFAOYSA-N
Data  1 IC50
  Tab Delimited (TSV)   2D SDfile   Computed 3D by Vconf -m prep SDfile
Find this compound or compounds like it in BindingDB:
Activity Spreadsheet -- Enzyme Inhibition Constant Data from BindingDB
Found 1 hit for monomerid = 465808
TargetTyrosine-protein kinase BTK(Homo sapiens (Human))
Chengdu Brilliant Pharmaceutical
US Patent
LigandPNGBDBM465808((S)-4-(8-amino-3-(5-(but-2-ynoyl)-5-azaspiro[2.4]h...)
Affinity DataIC50:  97nM. Assay description: 1: Test Principle:Mobility-Shift Assay, which is microfluidic chip technology, applies the basic concept of capillary electrophoresis to microfluidic...
Ligand InfoPC cidPC sid
In DepthDetails US Patent