BDBM465837 US10793576, Example 69
SMILES CC1(C)[C@H]2CN([C@@H]([C@@H]12)c1nc(-c2ccc(cc2)C(=O)Nc2cc(Cl)ccn2)c2c(N)nccn12)C(=O)C=C
InChI Key InChIKey=GETMYLMHWAHUAU-HARLFGEKSA-N
Data  1 IC50
  Tab Delimited (TSV)   2D SDfile   Computed 3D by Vconf -m prep SDfile
Find this compound or compounds like it in BindingDB:
Activity Spreadsheet -- Enzyme Inhibition Constant Data from BindingDB
Found 1 hit for monomerid = 465837
TargetTyrosine-protein kinase BTK(Homo sapiens (Human))
Chengdu Brilliant Pharmaceutical
US Patent
LigandPNGBDBM465837(US10793576, Example 69)
Affinity DataIC50:  1.40nM. Assay description: 1: Test Principle:Mobility-Shift Assay, which is microfluidic chip technology, applies the basic concept of capillary electrophoresis to microfluidic...
Ligand InfoPC cidPC sid
In DepthDetails US Patent