BDBM465874 US10793576, Example 106
SMILES Nc1nccn2c(nc(-c3ccc(Oc4ccccc4)cc3)c12)C1[C@@H]2CC(CN2)N1C(=O)C=C
InChI Key InChIKey=LFWCTIRKZLSWPZ-GTPZEUEISA-N
Data  1 IC50
  Tab Delimited (TSV)   2D SDfile   Computed 3D by Vconf -m prep SDfile
Find this compound or compounds like it in BindingDB:
Activity Spreadsheet -- Enzyme Inhibition Constant Data from BindingDB
Found 1 hit for monomerid = 465874
TargetTyrosine-protein kinase BTK(Homo sapiens (Human))
Chengdu Brilliant Pharmaceutical
US Patent
LigandPNGBDBM465874(US10793576, Example 106)
Affinity DataIC50:  47nM. Assay description: 1: Test Principle:Mobility-Shift Assay, which is microfluidic chip technology, applies the basic concept of capillary electrophoresis to microfluidic...
Ligand InfoPC cidPC sid
In DepthDetails US Patent