BDBM465881 Preparation of 4-(8-amino-3-((1S)-2-((E)-4-(dimethylamino)-2-butenoyl)octahydrocyclopenta [c]pyrrol-1-yl)imidazo[1,5-a]pyrazin-1-yl)-N-(pyridin-2-yl)benzamide::US10793576, Example 113
SMILES CN(C)C\C=C\C(=O)N1CC2CCCC2[C@H]1c1nc(-c2ccc(cc2)C(=O)Nc2ccccn2)c2c(N)nccn12
InChI Key InChIKey=PKYXSHDTLXVHSE-YSULFGTASA-N
Data  1 IC50
  Tab Delimited (TSV)   2D SDfile   Computed 3D by Vconf -m prep SDfile
Find this compound or compounds like it in BindingDB:
Activity Spreadsheet -- Enzyme Inhibition Constant Data from BindingDB
Found 1 hit for monomerid = 465881
TargetTyrosine-protein kinase BTK(Homo sapiens (Human))
Chengdu Brilliant Pharmaceutical
US Patent
LigandPNGBDBM465881(Preparation of 4-(8-amino-3-((1S)-2-((E)-4-(dimeth...)
Affinity DataIC50:  4.60nM. Assay description: 1: Test Principle:Mobility-Shift Assay, which is microfluidic chip technology, applies the basic concept of capillary electrophoresis to microfluidic...
Ligand InfoPC cidPC sid
In DepthDetails US Patent