BDBM465993 3-(1-ethyl-8-oxo-spiro[6,7- dihydro-4H-pyrazolo[3,4- c]azepine-5,4'- tetrahydropyran]-3-yl)propyl 4-cyclopentylsulfonylbenzoate::US10793580, Example 94
SMILES CCn1nc(CCCOC(=O)c2ccc(cc2)S(=O)(=O)C2CCCC2)c2CC3(CCOCC3)CNC(=O)c12
InChI Key InChIKey=QIFLWJFNWPNUEF-UHFFFAOYSA-N
Data  1 IC50
  Tab Delimited (TSV)   2D SDfile   Computed 3D by Vconf -m prep SDfile
Find this compound or compounds like it in BindingDB:
Activity Spreadsheet -- Enzyme Inhibition Constant Data from BindingDB
Found 1 hit for monomerid = 465993
TargetcAMP-specific 3',5'-cyclic phosphodiesterase 4D(Homo sapiens (Human))
Leo Pharma
US Patent
LigandPNGBDBM465993(3-(1-ethyl-8-oxo-spiro[6,7- dihydro-4H-pyrazolo[3,...)
Affinity DataIC50: <100nM. Assay description: The human PDE4D catalytic domain (UniProt no. Q08499 [S380-L740]) was incubated with a mixture of non-labelled cAMP (cyclic adenosine monophosphate) ...
Ligand InfoPC cidPC sid
In DepthDetails US Patent