BDBM466286 US10793582, Example 141
SMILES COCc1ccnc2nc(sc12)N1CCC[C@@H]1C(=O)NCc1ccccc1
InChI Key InChIKey=SBYASHRYFCTDER-MRXNPFEDSA-N
Data  1 IC50
  Tab Delimited (TSV)   2D SDfile   Computed 3D by Vconf -m prep SDfile
Find this compound or compounds like it in BindingDB:
Activity Spreadsheet -- Enzyme Inhibition Constant Data from BindingDB
Found 1 hit for monomerid = 466286
TargetKynurenine/alpha-aminoadipate aminotransferase, mitochondrial(Homo sapiens (Human))
Mitsubishi Tanabe Pharma
US Patent
LigandPNGBDBM466286(US10793582, Example 141)
Affinity DataIC50:  320nM. Assay description: To a reaction mixture (45 μL) containing 3.0 μmol/L kynurenine, 10 μmol/L pyridoxal phosphate, 2.0 ng/μL human recombinant KAT-II...
Ligand InfoPC cidPC sid
In DepthDetails US Patent