BDBM466320 US10799494, Compound RKA-310
SMILES COc1ccc2c(c1)[nH]c(-c1ccc(cc1)N1CCCCC1)c(C)c2=O
InChI Key InChIKey=LPOQKNIEVLYSJK-UHFFFAOYSA-N
Data  1 IC50
  Tab Delimited (TSV)   2D SDfile   Computed 3D by Vconf -m prep SDfile
Find this compound or compounds like it in BindingDB:
Activity Spreadsheet -- Enzyme Inhibition Constant Data from BindingDB
Found 1 hit for monomerid = 466320
LigandPNGBDBM466320(US10799494, Compound RKA-310)
Affinity DataIC50:  1.40E+3nM. Assay description: The Mtb cytochrome bd inhibition assay described in accompanying Example section, or elsewhere in the literature, may be used to measure the pharmaco...
Ligand InfoPC cidPC sid
In DepthDetails US Patent