BDBM466322 US10793591, Compound 63
SMILES C[C@@]1(N=[N+]=N)[C@H](O)[C@@](F)(COP(O)(=O)OP(O)(=O)OP(O)(O)=O)O[C@H]1n1ccc(N)nc1=O
InChI Key InChIKey=WSBGXVYFVGCNCE-MVHNUAHISA-O
Data  1 IC50
  Tab Delimited (TSV)   2D SDfile   Computed 3D by Vconf -m prep SDfile
Find this compound or compounds like it in BindingDB:
Activity Spreadsheet -- Enzyme Inhibition Constant Data from BindingDB
Found 1 hit for monomerid = 466322
TargetGenome polyprotein [1973-2419](Hepatitis C virus genotype 1b (isolate Con1) (HCV))
Janssen Biopharma
US Patent
LigandPNGBDBM466322(US10793591, Compound 63)
Affinity DataIC50: <1.00E+3nM. Assay description: The enzyme activity of NS5B570-Con1 (Delta-21) was measured as an incorporation of tritiated NMP into acid-insoluble RNA products. The complementary ...
Ligand InfoKEGGPC cidPC sid
In DepthDetails US Patent