BDBM466329 US10799494, Compound CK-2-63
SMILES Cc1c([nH]c2ccccc2c1=O)-c1ccc(Oc2ccc(OC(F)(F)F)cc2)cc1
InChI Key InChIKey=RLGYIDJKPCUPDL-UHFFFAOYSA-N
Data  1 IC50
  Tab Delimited (TSV)   2D SDfile   Computed 3D by Vconf -m prep SDfile
Find this compound or compounds like it in BindingDB:
Activity Spreadsheet -- Enzyme Inhibition Constant Data from BindingDB
Found 1 hit for monomerid = 466329
LigandPNGBDBM466329(US10799494, Compound CK-2-63)
Affinity DataIC50:  6.50E+3nM. Assay description: The Mtb cytochrome bd inhibition assay described in accompanying Example section, or elsewhere in the literature, may be used to measure the pharmaco...
Ligand InfoPC cidPC sid
In DepthDetails US Patent