BDBM46638 2-(4-methylphenyl)naphtho[2,3-g][1,2]benzothiazole-3,6,11-trione::2-(p-tolyl)naphtho[2,3-g][1,2]benzothiazole-3,6,11-trione::MLS-0315789.0001::cid_5023882
SMILES Cc1ccc(cc1)-n1sc2c3C(=O)c4ccccc4C(=O)c3ccc2c1=O
InChI Key InChIKey=VXHPDGQNVXDFJA-UHFFFAOYSA-N
Data  3 IC50
  Tab Delimited (TSV)   2D SDfile   Computed 3D by Vconf -m prep SDfile
Find this compound or compounds like it in BindingDB:
Activity Spreadsheet -- Enzyme Inhibition Constant Data from BindingDB
Found 3 hits for monomerid = 46638
TargetPhosphomannomutase 2(Homo sapiens (Human))
Burnham Center For Chemical Genomics
Curated by PubChem BioAssay
LigandPNGBDBM46638(2-(4-methylphenyl)naphtho[2,3-g][1,2]benzothiazole...)
Affinity DataIC50: >1.00E+5nM. Assay description: Data Source: Sanford-Burnham Center for Chemical Genomics (SBCCG) Source Affiliation: Sanford-Burnham Medical Research Institute (SBMRI, San Diego, C...
In DepthDetails PCBioAssay
TargetMannose-6-phosphate isomerase(Homo sapiens (Human))
Burnham Center For Chemical Genomics
Curated by PubChem BioAssay
LigandPNGBDBM46638(2-(4-methylphenyl)naphtho[2,3-g][1,2]benzothiazole...)
Affinity DataIC50: >5.00E+4nM. Assay description: Data Source: Sanford-Burnham Center for Chemical Genomics (SBCCG) Source Affiliation: Sanford-Burnham Medical Research Institute (SBMRI, San Diego, C...
In DepthDetails PCBioAssay
TargetPhosphoethanolamine/phosphocholine phosphatase(Homo sapiens (Human))
Burnham Center For Chemical Genomics
Curated by PubChem BioAssay
LigandPNGBDBM46638(2-(4-methylphenyl)naphtho[2,3-g][1,2]benzothiazole...)
Affinity DataIC50:  2.02E+3nM. Assay description: Data Source: Sanford-Burnham Center for Chemical Genomics (SBCCG) Source Affiliation: Sanford-Burnham Medical Research Institute (SBMRI, San Diego, C...
In DepthDetails PCBioAssay