BDBM466398 N-[(3,3- difluorocyclobutyl) methyl]-5-(7H- pyrrolo[2,3- d]pyrimidin-4-yl)- 5-azaspiro [2.5]octane- 8-carboxamide::US10799507, Example 56
SMILES FC1(F)CC(CNC(=O)C2CCN(CC22CC2)c2ncnc3[nH]ccc23)C1
InChI Key
Data  4 EC50
  Tab Delimited (TSV)   2D SDfile   Computed 3D by Vconf -m prep SDfile
Find this compound or compounds like it in BindingDB:
Activity Spreadsheet -- Enzyme Inhibition Constant Data from BindingDB
Found 4 hits for monomerid = 466398
TargetTyrosine-protein kinase JAK1(Homo sapiens (Human))
Leo Pharma
US Patent
LigandPNGBDBM466398(N-[(3,3- difluorocyclobutyl) methyl]-5-(7H- pyrrol...)
Affinity DataEC50:  3.90nM. Assay description: Human baculovirus-expressed JAK1, 2, 3 and TYK2 were purchased from Carna Biosciences, Inc. All four purified enzymes contain only the catalytic doma...
Ligand InfoPC cidPC sid
In DepthDetails US Patent
TargetNon-receptor tyrosine-protein kinase TYK2(Homo sapiens (Human))
Leo Pharma
US Patent
LigandPNGBDBM466398(N-[(3,3- difluorocyclobutyl) methyl]-5-(7H- pyrrol...)
Affinity DataEC50:  170nM. Assay description: Human baculovirus-expressed JAK1, 2, 3 and TYK2 were purchased from Carna Biosciences, Inc. All four purified enzymes contain only the catalytic doma...
Ligand InfoPC cidPC sid
In DepthDetails US Patent
TargetTyrosine-protein kinase JAK3(Homo sapiens (Human))
Leo Pharma
US Patent
LigandPNGBDBM466398(N-[(3,3- difluorocyclobutyl) methyl]-5-(7H- pyrrol...)
Affinity DataEC50:  18.1nM. Assay description: Human baculovirus-expressed JAK1, 2, 3 and TYK2 were purchased from Carna Biosciences, Inc. All four purified enzymes contain only the catalytic doma...
Ligand InfoPC cidPC sid
In DepthDetails US Patent
TargetTyrosine-protein kinase JAK2(Homo sapiens (Human))
Leo Pharma
US Patent
LigandPNGBDBM466398(N-[(3,3- difluorocyclobutyl) methyl]-5-(7H- pyrrol...)
Affinity DataEC50:  8.30nM. Assay description: Human baculovirus-expressed JAK1, 2, 3 and TYK2 were purchased from Carna Biosciences, Inc. All four purified enzymes contain only the catalytic doma...
Ligand InfoPC cidPC sid
In DepthDetails US Patent