BDBM466516 US10800725, Compound 4
SMILES COc1ccccc1CCC(=O)C1=C(O)C(CCC(C)C)=C(O)C(CCC(C)C)(CCC(C)C)C1=O
InChI Key InChIKey=UCJKFQMBZVUAAK-UHFFFAOYSA-N
Data  3 IC50
  Tab Delimited (TSV)   2D SDfile   Computed 3D by Vconf -m prep SDfile
Find this compound or compounds like it in BindingDB:
Activity Spreadsheet -- Enzyme Inhibition Constant Data from BindingDB
Found 3 hits for monomerid = 466516
TargetDNA-directed RNA polymerase subunit alpha(Escherichia coli K-12)
TBA
US Patent
LigandPNGBDBM466516(US10800725, Compound 4)
Affinity DataIC50:  1.90E+3nM. Assay description: Fluorescence-detected RNA polymerase assays with E. coli RNA polymerase were performed by a modification of the procedure of Kuhlman et al., 2004 [Ku...
Ligand InfoPC cidPC sid
In DepthDetails US Patent
LigandPNGBDBM466516(US10800725, Compound 4)
Affinity DataIC50:  4.30E+3nM. Assay description: Fluorescence-detected RNA polymerase assays with S. aureus RNA polymerase were performed as in Example 21.1, using reaction mixtures containing (20 &...
Ligand InfoPC cidPC sid
In DepthDetails US Patent
LigandPNGBDBM466516(US10800725, Compound 4)
Affinity DataIC50:  1.60E+3nM. Assay description: Fluorescence-detected RNA polymerase assays with M. tuberculosis RNA polymerase were performed as in Example 21.1, using reaction mixtures containing...
Ligand InfoPC cidPC sid
In DepthDetails US Patent