BDBM466534 US10800739, Compound (11)::US11420940, cpd (11)
SMILES NC(=O)c1cccc2CN(C3CCN(CC3)C3CCCCC3)C(=O)c12
InChI Key InChIKey=QBKPYKWJSWOHNY-UHFFFAOYSA-N
Data  4 Kd
  Tab Delimited (TSV)   2D SDfile   Computed 3D by Vconf -m prep SDfile
Find this compound or compounds like it in BindingDB:
Activity Spreadsheet -- Enzyme Inhibition Constant Data from BindingDB
Found 4 hits for monomerid = 466534
TargetPoly [ADP-ribose] polymerase 1(Homo sapiens (Human))
Nerviano Medical Sciences
US Patent
LigandPNGBDBM466534(US10800739, Compound (11) | US11420940, cpd (11))
Affinity DataKd: <10nM. Assay description: Preferably, for the screening method above cited, both the PARP protein and the 5H-phenanthridin-6-one-derived probe of formula (IP) are pre-mixed, o...
Ligand InfoPC cidPC sid
In DepthDetails US Patent
TargetPoly [ADP-ribose] polymerase 2(Homo sapiens (Human))
Nerviano Medical Sciences
US Patent
LigandPNGBDBM466534(US10800739, Compound (11) | US11420940, cpd (11))
Affinity DataKd:  1.40E+3nM. Assay description: The assay is based on the use of a probe of formula (IP) that binds to the NAD binding pocket and takes advantage of the significant change in the po...
Ligand InfoPC cidPC sid
In DepthDetails US Patent
TargetPoly [ADP-ribose] polymerase 1(Homo sapiens (Human))
Nerviano Medical Sciences
US Patent
LigandPNGBDBM466534(US10800739, Compound (11) | US11420940, cpd (11))
Affinity DataKd: <10nM. Assay description: The assay is based on the use of a probe of formula (IP) that binds to the NAD binding pocket and takes advantage of the significant change in the po...
Ligand InfoPC cidPC sid
In DepthDetails US Patent
TargetPoly [ADP-ribose] polymerase 2(Homo sapiens (Human))
Nerviano Medical Sciences
US Patent
LigandPNGBDBM466534(US10800739, Compound (11) | US11420940, cpd (11))
Affinity DataKd:  1.40E+3nM. Assay description: Preferably, for the screening method above cited, both the PARP protein and the 5H-phenanthridin-6-one-derived probe of formula (IP) are pre-mixed, o...
Ligand InfoPC cidPC sid
In DepthDetails US Patent