BDBM466546 US10799518, Compound 14::rel-(2R,3 S)-3-[(4- brornophenyl)carbarnoyl]spiro [bicyclo[2.2.1]heptane-7,1'- cyclopropane]-2-carboxylic acid
SMILES OC(=O)C1C2CCC(C1C(=O)Nc1ccc(Br)cc1)C21CC1
InChI Key InChIKey=DETBEVWYVMTYIY-UHFFFAOYSA-N
Data  1 EC50
  Tab Delimited (TSV)   2D SDfile   Computed 3D by Vconf -m prep SDfile
Find this compound or compounds like it in BindingDB:
Activity Spreadsheet -- Enzyme Inhibition Constant Data from BindingDB
Found 1 hit for monomerid = 466546
TargetN-formyl peptide receptor 2(Homo sapiens (Human))
Allergan
US Patent
LigandPNGBDBM466546(US10799518, Compound 14 | rel-(2R,3 S)-3-[(4- bror...)
Affinity DataEC50:  4nM. Assay description: HEK-Gα16 cells stably expressing the human FPR2 receptor was utilized. Cells were plated into 384-well poly-D-lysine coated plates at a density ...
Ligand InfoPC cidPC sid
In DepthDetails US Patent