BDBM466563 3-{[4- (methylsulfanyl)phenyl] carbamoyl} spiro[bicyclo[2.2.1]heptane- 7,1'-cyclopropane]-5-ene-2- carboxylic acid::US10799518, Compound 31
SMILES CSc1ccc(NC(=O)C2C3C=CC(C2C(O)=O)C32CC2)cc1
InChI Key InChIKey=LFGWWLFSERCGDU-UHFFFAOYSA-N
Data  1 EC50
  Tab Delimited (TSV)   2D SDfile   Computed 3D by Vconf -m prep SDfile
Find this compound or compounds like it in BindingDB:
Activity Spreadsheet -- Enzyme Inhibition Constant Data from BindingDB
Found 1 hit for monomerid = 466563
TargetN-formyl peptide receptor 2(Homo sapiens (Human))
Allergan
US Patent
LigandPNGBDBM466563(3-{[4- (methylsulfanyl)phenyl] carbamoyl} spiro[bi...)
Affinity DataEC50:  14nM. Assay description: HEK-Gα16 cells stably expressing the human FPR2 receptor was utilized. Cells were plated into 384-well poly-D-lysine coated plates at a density ...
Ligand InfoPC cidPC sid
In DepthDetails US Patent