BDBM466566 US10800755, Example 20
SMILES Cc1cccc(n1)C1=CCN(CCNC(=O)C2CCCCO2)CC1
InChI Key InChIKey=MRPRDAAKTDVUPC-UHFFFAOYSA-N
Data  4 IC50  2 EC50
  Tab Delimited (TSV)   2D SDfile   Computed 3D by Vconf -m prep SDfile
Find this compound or compounds like it in BindingDB:
Activity Spreadsheet -- Enzyme Inhibition Constant Data from BindingDB
Found 6 hits for monomerid = 466566
Target5-hydroxytryptamine receptor 1A(Homo sapiens (Human))
Sumitomo Dainippon Pharma
US Patent
LigandPNGBDBM466566(US10800755, Example 20)
Affinity DataIC50:  6.80nM. Assay description: The binding affinity of the present compounds to human 5-HT1A receptor, human D4 receptor, and human D2 receptor was measured in a manner mentioned b...
Ligand InfoPC cidPC sid
In DepthDetails US Patent
TargetD(4) dopamine receptor(Homo sapiens (Human))
Sumitomo Dainippon Pharma
US Patent
LigandPNGBDBM466566(US10800755, Example 20)
Affinity DataIC50:  92nM. Assay description: The binding affinity of the present compounds to human 5-HT1A receptor, human D4 receptor, and human D2 receptor was measured in a manner mentioned b...
Ligand InfoPC cidPC sid
In DepthDetails US Patent
TargetD(4) dopamine receptor(Homo sapiens (Human))
Sumitomo Dainippon Pharma
US Patent
LigandPNGBDBM466566(US10800755, Example 20)
Affinity DataEC50:  15nM. Assay description: Aequorin, Gα16 proteins, and each receptor were transiently expressed in CHO-K1 cell (Chinese hamster ovary), and seeded to 384-well plate. The ...
Ligand InfoPC cidPC sid
In DepthDetails US Patent
TargetPotassium voltage-gated channel subfamily H member 2(Homo sapiens (Human))
Sumitomo Dainippon Pharma
US Patent
LigandPNGBDBM466566(US10800755, Example 20)
Affinity DataIC50: >1.00E+4nM. Assay description: The activity of the present compound for inhibiting hERG channel was measured by whole-cell patch clamp method with auto patch clamp system, using CH...
Ligand InfoPC cidPC sid
In DepthDetails US Patent
Target5-hydroxytryptamine receptor 1A(Homo sapiens (Human))
Sumitomo Dainippon Pharma
US Patent
LigandPNGBDBM466566(US10800755, Example 20)
Affinity DataEC50:  57nM. Assay description: Aequorin, Gα16 proteins, and each receptor were transiently expressed in CHO-K1 cell (Chinese hamster ovary), and seeded to 384-well plate. The ...
Ligand InfoPC cidPC sid
In DepthDetails US Patent
TargetD(2) dopamine receptor(Homo sapiens (Human))
Sumitomo Dainippon Pharma
US Patent
LigandPNGBDBM466566(US10800755, Example 20)
Affinity DataIC50: >1.00E+4nM. Assay description: The binding affinity of the present compounds to human 5-HT1A receptor, human D4 receptor, and human D2 receptor was measured in a manner mentioned b...
Ligand InfoPC cidPC sid
In DepthDetails US Patent