BDBM466575 N-[2-(6-Methyl-3′,6′-dihydro[2,4′-bipyridin]-1′(2′H)-yl) ethyl]-tetrahydro-2H-pyran-4-carboxamide::US10800755, Example 29::US11014905, Example 29
SMILES Cc1cccc(n1)C1=CCN(CCNC(=O)C2CCOCC2)CC1
InChI Key InChIKey=LWUCNZZPRVNCLB-UHFFFAOYSA-N
Data  3 KI  4 IC50  2 EC50
  Tab Delimited (TSV)   2D SDfile   Computed 3D by Vconf -m prep SDfile
Find this compound or compounds like it in BindingDB:
Activity Spreadsheet -- Enzyme Inhibition Constant Data from BindingDB
Found 9 hits for monomerid = 466575
TargetD(2) dopamine receptor(Homo sapiens (Human))
Sumitomo Dainippon Pharma
US Patent
LigandPNGBDBM466575(N-[2-(6-Methyl-3′,6′-dihydro[2,4′...)
Affinity DataKi:  0.400nM. Assay description: The binding affinity of the present compounds to human 5-HT1A receptor, human D4 receptor, and human D2 receptor was measured in a manner mentioned b...
Ligand InfoPC cidPC sid
In DepthDetails US Patent
TargetD(4) dopamine receptor(Homo sapiens (Human))
Sumitomo Dainippon Pharma
US Patent
LigandPNGBDBM466575(N-[2-(6-Methyl-3′,6′-dihydro[2,4′...)
Affinity DataKi:  22nM. Assay description: The binding affinity of the present compounds to human 5-HT1A receptor, human D4 receptor, and human D2 receptor was measured in a manner mentioned b...
Ligand InfoPC cidPC sid
In DepthDetails US Patent
Target5-hydroxytryptamine receptor 1A(Homo sapiens (Human))
Sumitomo Dainippon Pharma
US Patent
LigandPNGBDBM466575(N-[2-(6-Methyl-3′,6′-dihydro[2,4′...)
Affinity DataKi: >1.00E+4nM. Assay description: The binding affinity of the present compounds to human 5-HT1A receptor, human D4 receptor, and human D2 receptor was measured in a manner mentioned b...
Ligand InfoPC cidPC sid
In DepthDetails US Patent
TargetPotassium voltage-gated channel subfamily H member 2(Homo sapiens (Human))
Sumitomo Dainippon Pharma
US Patent
LigandPNGBDBM466575(N-[2-(6-Methyl-3′,6′-dihydro[2,4′...)
Affinity DataIC50: >1.00E+4nM. Assay description: The activity of the present compound for inhibiting hERG channel was measured by whole-cell patch clamp method with auto patch clamp system, using CH...
Ligand InfoPC cidPC sid
In DepthDetails US Patent
TargetD(4) dopamine receptor(Homo sapiens (Human))
Sumitomo Dainippon Pharma
US Patent
LigandPNGBDBM466575(N-[2-(6-Methyl-3′,6′-dihydro[2,4′...)
Affinity DataEC50:  24nM. Assay description: Aequorin, Gα16 proteins, and each receptor were transiently expressed in CHO-K1 cell (Chinese hamster ovary), and seeded to 384-well plate. The ...
Ligand InfoPC cidPC sid
In DepthDetails US Patent
TargetD(2) dopamine receptor(Homo sapiens (Human))
Sumitomo Dainippon Pharma
US Patent
LigandPNGBDBM466575(N-[2-(6-Methyl-3′,6′-dihydro[2,4′...)
Affinity DataIC50: >1.00E+4nM. Assay description: The binding affinity of the present compounds to human 5-HT1A receptor, human D4 receptor, and human D2 receptor was measured in a manner mentioned b...
Ligand InfoPC cidPC sid
In DepthDetails US Patent
TargetD(4) dopamine receptor(Homo sapiens (Human))
Sumitomo Dainippon Pharma
US Patent
LigandPNGBDBM466575(N-[2-(6-Methyl-3′,6′-dihydro[2,4′...)
Affinity DataIC50:  22nM. Assay description: The binding affinity of the present compounds to human 5-HT1A receptor, human D4 receptor, and human D2 receptor was measured in a manner mentioned b...
Ligand InfoPC cidPC sid
In DepthDetails US Patent
Target5-hydroxytryptamine receptor 1A(Homo sapiens (Human))
Sumitomo Dainippon Pharma
US Patent
LigandPNGBDBM466575(N-[2-(6-Methyl-3′,6′-dihydro[2,4′...)
Affinity DataIC50:  0.400nM. Assay description: The binding affinity of the present compounds to human 5-HT1A receptor, human D4 receptor, and human D2 receptor was measured in a manner mentioned b...
Ligand InfoPC cidPC sid
In DepthDetails US Patent
Target5-hydroxytryptamine receptor 1A(Homo sapiens (Human))
Sumitomo Dainippon Pharma
US Patent
LigandPNGBDBM466575(N-[2-(6-Methyl-3′,6′-dihydro[2,4′...)
Affinity DataEC50: <10nM. Assay description: Aequorin, Gα16 proteins, and each receptor were transiently expressed in CHO-K1 cell (Chinese hamster ovary), and seeded to 384-well plate. The ...
Ligand InfoPC cidPC sid
In DepthDetails US Patent