BDBM466601 US10800757, Compound 17::US10889568, Compound 17::[4-(6-Amino-pyridazin-3-yl)- piperidin-1-yl]-[5-(4-fluoro-phenoxy)- 4-methoxy-pyridin-2-yl]-methanone
SMILES COc1cc(ncc1Oc1ccc(F)cc1)C(=O)N1CCC(CC1)c1ccc(N)nn1
InChI Key InChIKey=JUALOUHZJJERQT-UHFFFAOYSA-N
Data  2 IC50
  Tab Delimited (TSV)   2D SDfile   Computed 3D by Vconf -m prep SDfile
Find this compound or compounds like it in BindingDB:
Activity Spreadsheet -- Enzyme Inhibition Constant Data from BindingDB
Found 2 hits for monomerid = 466601
TargetShort transient receptor potential channel 6(Homo sapiens (Human))
Boehringer Ingelheim International
US Patent
LigandPNGBDBM466601(US10800757, Compound 17 | US10889568, Compound 17 ...)
Affinity DataIC50:  29nM. Assay description: This screening assay measures TRPC6 (transient receptor potential cation channel, subfamily C, member 6) ion channel activation via addition either o...
In DepthDetails US Patent
TargetShort transient receptor potential channel 6(Homo sapiens (Human))
Boehringer Ingelheim International
US Patent
LigandPNGBDBM466601(US10800757, Compound 17 | US10889568, Compound 17 ...)
Affinity DataIC50:  29nM. Assay description: The commercially available HEK293/TREx line (Invitrogen) was stably transfected with a TRPC6 construct and screened by conventional calcium imaging t...
In DepthDetails US Patent