BDBM466602 US10800757, Compound 18::US10889568, Compound 18::[(R)-4-(6-Amino-4-methyl-pyridin-3- yl)-2-hydroxymethyl-piperazin-1-yl]- (4-methoxy-5-phenoxy-pyridin-2-yl)- methanone
SMILES COc1cc(ncc1Oc1ccccc1)C(=O)N1CCN(C[C@@H]1CO)c1cnc(N)cc1C
InChI Key InChIKey=ICBOELWCPSURFK-QGZVFWFLSA-N
Data  2 IC50
  Tab Delimited (TSV)   2D SDfile   Computed 3D by Vconf -m prep SDfile
Find this compound or compounds like it in BindingDB:
Activity Spreadsheet -- Enzyme Inhibition Constant Data from BindingDB
Found 2 hits for monomerid = 466602
TargetShort transient receptor potential channel 6(Homo sapiens (Human))
Boehringer Ingelheim International
US Patent
LigandPNGBDBM466602(US10800757, Compound 18 | US10889568, Compound 18 ...)
Affinity DataIC50:  31nM. Assay description: This screening assay measures TRPC6 (transient receptor potential cation channel, subfamily C, member 6) ion channel activation via addition either o...
Ligand InfoPC cidPC sid
In DepthDetails US Patent
TargetShort transient receptor potential channel 6(Homo sapiens (Human))
Boehringer Ingelheim International
US Patent
LigandPNGBDBM466602(US10800757, Compound 18 | US10889568, Compound 18 ...)
Affinity DataIC50:  31nM. Assay description: The commercially available HEK293/TREx line (Invitrogen) was stably transfected with a TRPC6 construct and screened by conventional calcium imaging t...
Ligand InfoPC cidPC sid
In DepthDetails US Patent