BDBM46663 8-(1,3-benzodioxol-5-yl)-3-benzyl-6-keto-2,4,7,8-tetrahydropyrido[2,1-b][1,3,5]thiadiazine-9-carbonitrile::8-(1,3-benzodioxol-5-yl)-3-benzyl-6-oxo-2,4,7,8-tetrahydropyrido[2,1-b][1,3,5]thiadiazine-9-carbonitrile::8-(1,3-benzodioxol-5-yl)-6-oxidanylidene-3-(phenylmethyl)-2,4,7,8-tetrahydropyrido[2,1-b][1,3,5]thiadiazine-9-carbonitrile::8-(1,3-benzodioxol-5-yl)-6-oxo-3-(phenylmethyl)-2,4,7,8-tetrahydropyrido[2,1-b][1,3,5]thiadiazine-9-carbonitrile::MLS-0067811.0001::cid_666005
SMILES O=C1CC(C(C#N)=C2SCN(Cc3ccccc3)CN12)c1ccc2OCOc2c1
InChI Key InChIKey=NELGWBDLQWNGRE-UHFFFAOYSA-N
Data  3 IC50
  Tab Delimited (TSV)   2D SDfile   Computed 3D by Vconf -m prep SDfile
Find this compound or compounds like it in BindingDB:
Activity Spreadsheet -- Enzyme Inhibition Constant Data from BindingDB
Found 3 hits for monomerid = 46663
TargetPhosphomannomutase 2(Homo sapiens (Human))
Burnham Center For Chemical Genomics
Curated by PubChem BioAssay
LigandPNGBDBM46663(8-(1,3-benzodioxol-5-yl)-3-benzyl-6-keto-2,4,7,8-t...)
Affinity DataIC50: >1.00E+5nM. Assay description: Data Source: Sanford-Burnham Center for Chemical Genomics (SBCCG) Source Affiliation: Sanford-Burnham Medical Research Institute (SBMRI, San Diego, C...
In DepthDetails PCBioAssay
TargetMannose-6-phosphate isomerase(Homo sapiens (Human))
Sanford-Burnham Center For Chemical Genomics
Curated by PubChem BioAssay
LigandPNGBDBM46663(8-(1,3-benzodioxol-5-yl)-3-benzyl-6-keto-2,4,7,8-t...)
Affinity DataIC50:  1.60E+4nM. Assay description: Data Source: Sanford-Burnham Center for Chemical Genomics (SBCCG) Source Affiliation: Sanford-Burnham Medical Research Institute (SBMRI, San Diego, C...
In DepthDetails PCBioAssay
TargetMannose-6-phosphate isomerase(Homo sapiens (Human))
Sanford-Burnham Center For Chemical Genomics
Curated by PubChem BioAssay
LigandPNGBDBM46663(8-(1,3-benzodioxol-5-yl)-3-benzyl-6-keto-2,4,7,8-t...)
Affinity DataIC50:  3.69E+4nM. Assay description: Data Source: Sanford-Burnham Center for Chemical Genomics (SBCCG) Source Affiliation: Sanford-Burnham Medical Research Institute (SBMRI, San Diego, C...
In DepthDetails PCBioAssay