BDBM466729 US10800761, Example 48::US11731958, Example 48
SMILES COc1cccc(F)c1-c1nccc(n1)C(=O)Nc1ccc(cc1N1C[C@@H](N)C[C@H]1CO)C(C)C
InChI Key InChIKey=BJCGXALNCRGPBG-ROUUACIJSA-N
Data  2 KI
  Tab Delimited (TSV)   2D SDfile   Computed 3D by Vconf -m prep SDfile
Find this compound or compounds like it in BindingDB:
Activity Spreadsheet -- Enzyme Inhibition Constant Data from BindingDB
Found 2 hits for monomerid = 466729
TargetMitogen-activated protein kinase kinase kinase kinase 1(Homo sapiens (Human))
Incyte
US Patent
LigandPNGBDBM466729(US10800761, Example 48 | US11731958, Example 48)
Affinity DataKi: <100nM. Assay description: A stock solution of 1 mM test compound was prepared in DMSO. The compound plate was prepared by 3-fold and 11-point serial dilutions. 0.1 μL of ...
Ligand InfoPC cidPC sid
In DepthDetails US Patent
TargetMitogen-activated protein kinase kinase kinase kinase 1(Homo sapiens (Human))
Incyte
US Patent
LigandPNGBDBM466729(US10800761, Example 48 | US11731958, Example 48)
Affinity DataKi: <100nM. Assay description: A stock solution of 1 mM test compound was prepared in DMSO. The compound plate was prepared by 3-fold and 11-point serial dilutions. 0.1 μL of ...
Ligand InfoPC cidPC sid
In DepthDetails US Patent