BDBM466887 US10800767, Example 29P2
SMILES C[C@H](O)c1cc(Oc2c(Cl)cc(NC(=O)c3noc(=O)[nH]3)cc2Cl)n[nH]c1=O
InChI Key
Data  2 EC50
  Tab Delimited (TSV)   2D SDfile   Computed 3D by Vconf -m prep SDfile
Find this compound or compounds like it in BindingDB:
Activity Spreadsheet -- Enzyme Inhibition Constant Data from BindingDB
Found 2 hits for monomerid = 466887
TargetThyroid hormone receptor alpha(Homo sapiens (Human))
Terns
US Patent
LigandPNGBDBM466887(US10800767, Example 29P2)
Affinity DataEC50:  1.76E+3nM. Assay description: LanthaScreen TR-FRET Thyroid Receptor alpha Coactivator Assay kit (ThermoFisher) and LanthaScreen™ TR-FRET Thyroid Receptor beta Coactivator Assay ki...
Ligand InfoPC cidPC sid
In DepthDetails US Patent
TargetThyroid hormone receptor beta(Homo sapiens (Human))
Terns
US Patent
LigandPNGBDBM466887(US10800767, Example 29P2)
Affinity DataEC50:  91.3nM. Assay description: LanthaScreen TR-FRET Thyroid Receptor alpha Coactivator Assay kit (ThermoFisher) and LanthaScreen™ TR-FRET Thyroid Receptor beta Coactivator Assay ki...
Ligand InfoPC cidPC sid
In DepthDetails US Patent