BDBM466889 US10800767, Example 31
SMILES Clc1cc(NC(=O)c2noc(=O)[nH]2)cc(Cl)c1Oc1cc(c(=O)[nH]n1)C12CC(C1)C2
InChI Key InChIKey=QEEYZCBAAVHYMJ-UHFFFAOYSA-N
Data  2 EC50
  Tab Delimited (TSV)   2D SDfile   Computed 3D by Vconf -m prep SDfile
Find this compound or compounds like it in BindingDB:
Activity Spreadsheet -- Enzyme Inhibition Constant Data from BindingDB
Found 2 hits for monomerid = 466889
TargetThyroid hormone receptor alpha(Homo sapiens (Human))
Terns
US Patent
LigandPNGBDBM466889(US10800767, Example 31)
Affinity DataEC50: >5.00E+3nM. Assay description: LanthaScreen TR-FRET Thyroid Receptor alpha Coactivator Assay kit (ThermoFisher) and LanthaScreen™ TR-FRET Thyroid Receptor beta Coactivator Assay ki...
Ligand InfoPC cidPC sid
In DepthDetails US Patent
TargetThyroid hormone receptor beta(Homo sapiens (Human))
Terns
US Patent
LigandPNGBDBM466889(US10800767, Example 31)
Affinity DataEC50:  600nM. Assay description: LanthaScreen TR-FRET Thyroid Receptor alpha Coactivator Assay kit (ThermoFisher) and LanthaScreen™ TR-FRET Thyroid Receptor beta Coactivator Assay ki...
Ligand InfoPC cidPC sid
In DepthDetails US Patent