BDBM466913 1-(4-{6-[(3R)-3- Methylmorpholin-4-yl]-2- {1H-pyrrolo[2,3-b]pyridin-4- yl}pyrimidin-4-yl}piperidin- 1-yl) ethan-1-one::US10800774, Example 12
SMILES C[C@@H]1COCCN1c1cc(nc(n1)-c1ccnc2[nH]ccc12)C1CCN(CC1)C(C)=O
InChI Key
Data  2 IC50
  Tab Delimited (TSV)   2D SDfile   Computed 3D by Vconf -m prep SDfile
Find this compound or compounds like it in BindingDB:
Activity Spreadsheet -- Enzyme Inhibition Constant Data from BindingDB
Found 2 hits for monomerid = 466913
TargetATR-interacting protein/Serine/threonine-protein kinase ATR(Homo sapiens (Human))
Board Of Regents, The University Of Texas System
US Patent
LigandPNGBDBM466913(1-(4-{6-[(3R)-3- Methylmorpholin-4-yl]-2- {1H-pyrr...)
Affinity DataIC50:  24nM. Assay description: Human full-length FLAG-TEV-ATR and His6-ATRIP were co-expressed in HEK293 cells. The cell pellet (20 g) was harvested and lysed in 100 mL of lysis bu...
Ligand InfoPC cidPC sid
In DepthDetails US Patent
TargetSerine/threonine-protein kinase Chk1(Homo sapiens (Human))
Board Of Regents, The University Of Texas System
US Patent
LigandPNGBDBM466913(1-(4-{6-[(3R)-3- Methylmorpholin-4-yl]-2- {1H-pyrr...)
Affinity DataIC50:  128nM. Assay description: Inhibitors of ATR kinase are effective at inhibiting the ATR-driven phosphorylation of the downstream target Chk1 kinase at Serine 345, following the...
Ligand InfoPC cidPC sid
In DepthDetails US Patent