BDBM466953 8-chloro-3-((2,2-difluorocyclopropyl) methyl)-7-(m-tolyl)-[1,2,4] triazole[4,3-a]pyridine::US10800776, Example 36
SMILES Cc1cccc(c1)-c1ccn2c(CC3CC3(F)F)nnc2c1Cl
InChI Key InChIKey=TVWGIKXUDJNQGS-UHFFFAOYSA-N
Data  1 IC50  1 EC50
  Tab Delimited (TSV)   2D SDfile   Computed 3D by Vconf -m prep SDfile
Find this compound or compounds like it in BindingDB:
Activity Spreadsheet -- Enzyme Inhibition Constant Data from BindingDB
Found 2 hits for monomerid = 466953
TargetPotassium voltage-gated channel subfamily H member 2(Homo sapiens (Human))
Shanghai Institute Of Material Medica, Chinese Academy Of Sciences
US Patent
LigandPNGBDBM466953(8-chloro-3-((2,2-difluorocyclopropyl) methyl)-7-(m...)
Affinity DataIC50: >4.00E+4nM. Assay description: Experimental method: hERG patch clamp detection methodExperimental procedure: Compound preparation: the stock solution of a compound was diluted with...
Ligand InfoPC cidPC sid
In DepthDetails US Patent
TargetMetabotropic glutamate receptor 2(Homo sapiens (Human))
Shanghai Institute Of Material Medica, Chinese Academy Of Sciences
US Patent
LigandPNGBDBM466953(8-chloro-3-((2,2-difluorocyclopropyl) methyl)-7-(m...)
Affinity DataEC50:  130nM. Assay description: Experimental materials: HEK/mGluR2 cell line (human GluR2 transfected HEK cell line), DMEM (FBS) medium, positive control LY487379 (purchased from si...
Ligand InfoPC cidPC sid
In DepthDetails US Patent