BDBM466975 (2R)-2-(((2S,5R)-2-carbamoyl-3-cyclopropyl-7-oxo-1,6-diazabicyclo[3.2.1]oct-3-en-6-yl)oxy)-2-fluoroacetic acid lithium salt::US10800778, Example 42
SMILES NC(=O)[C@H]1N2C[C@@H](C=C1C1CC1)N(O[C@@H](F)C(O)=O)C2=O
InChI Key InChIKey=ZEICLMMMMGQHIK-TWSLBNPLSA-N
Data  3 IC50
  Tab Delimited (TSV)   2D SDfile   Computed 3D by Vconf -m prep SDfile
Find this compound or compounds like it in BindingDB:
Activity Spreadsheet -- Enzyme Inhibition Constant Data from BindingDB
Found 3 hits for monomerid = 466975
TargetBeta-lactamase TEM(Escherichia coli)
Entasis Therapeutics
US Patent
LigandPNGBDBM466975((2R)-2-(((2S,5R)-2-carbamoyl-3-cyclopropyl-7-oxo-1...)
Affinity DataIC50:  24nM. Assay description: A buffer consisting of 0.1 M sodium phosphate (pH 7.0), 10 mM NaHCO3, and 0.005% Triton X-100 was used for all enzymes. The chromogenic substrate nit...
Ligand InfoPC cidPC sid
In DepthDetails US Patent
TargetBeta-lactamase(Klebsiella pneumoniae)
Entasis Therapeutics
US Patent
LigandPNGBDBM466975((2R)-2-(((2S,5R)-2-carbamoyl-3-cyclopropyl-7-oxo-1...)
Affinity DataIC50:  5.20nM. Assay description: A buffer consisting of 0.1 M sodium phosphate (pH 7.0), 10 mM NaHCO3, and 0.005% Triton X-100 was used for all enzymes. The chromogenic substrate nit...
Ligand InfoPC cidPC sid
In DepthDetails US Patent
TargetBeta-lactamase(Escherichia coli)
Entasis Therapeutics
US Patent
LigandPNGBDBM466975((2R)-2-(((2S,5R)-2-carbamoyl-3-cyclopropyl-7-oxo-1...)
Affinity DataIC50:  95nM. Assay description: A buffer consisting of 0.1 M sodium phosphate (pH 7.0), 10 mM NaHCO3, and 0.005% Triton X-100 was used for all enzymes. The chromogenic substrate nit...
Ligand InfoPC cidPC sid
In DepthDetails US Patent