BDBM466983 (2S)-2-fluoro-2-[[(2S,5R)-2-[2-(methanesulfonamido)ethylcarbamoyl]-3-methyl-7-oxo-1,6-diazabicyclo[3.2.1]oct-3-en-6-yl]oxy]acetic acid lithium salt::US10800778, Example 67
SMILES CC1=C[C@@H]2CN([C@@H]1C(=O)NCCNS(C)(=O)=O)C(=O)N2O[C@@H](F)C(O)=O
InChI Key InChIKey=VRAFEQHIWHNGLC-CBMCFHRWSA-N
Data  3 IC50
  Tab Delimited (TSV)   2D SDfile   Computed 3D by Vconf -m prep SDfile
Find this compound or compounds like it in BindingDB:
Activity Spreadsheet -- Enzyme Inhibition Constant Data from BindingDB
Found 3 hits for monomerid = 466983
TargetBeta-lactamase TEM(Escherichia coli)
Entasis Therapeutics
US Patent
LigandPNGBDBM466983((2S)-2-fluoro-2-[[(2S,5R)-2-[2-(methanesulfonamido...)
Affinity DataIC50:  64nM. Assay description: A buffer consisting of 0.1 M sodium phosphate (pH 7.0), 10 mM NaHCO3, and 0.005% Triton X-100 was used for all enzymes. The chromogenic substrate nit...
Ligand InfoPC cidPC sid
In DepthDetails US Patent
TargetBeta-lactamase(Klebsiella pneumoniae)
Entasis Therapeutics
US Patent
LigandPNGBDBM466983((2S)-2-fluoro-2-[[(2S,5R)-2-[2-(methanesulfonamido...)
Affinity DataIC50:  340nM. Assay description: A buffer consisting of 0.1 M sodium phosphate (pH 7.0), 10 mM NaHCO3, and 0.005% Triton X-100 was used for all enzymes. The chromogenic substrate nit...
Ligand InfoPC cidPC sid
In DepthDetails US Patent
TargetBeta-lactamase(Escherichia coli)
Entasis Therapeutics
US Patent
LigandPNGBDBM466983((2S)-2-fluoro-2-[[(2S,5R)-2-[2-(methanesulfonamido...)
Affinity DataIC50:  7.30nM. Assay description: A buffer consisting of 0.1 M sodium phosphate (pH 7.0), 10 mM NaHCO3, and 0.005% Triton X-100 was used for all enzymes. The chromogenic substrate nit...
Ligand InfoPC cidPC sid
In DepthDetails US Patent