BDBM46701 (4-chlorodithiazol-5-ylidene)-(m-tolyl)amine::4-chloranyl-N-(3-methylphenyl)-1,2,3-dithiazol-5-imine::4-chloro-N-(3-methylphenyl)-5-dithiazolimine::4-chloro-N-(3-methylphenyl)dithiazol-5-imine::MLS-0390889.0001::cid_25181212
SMILES Cc1cccc(c1)\N=c1\ssnc1Cl
InChI Key InChIKey=OPBVEGBRJGQOIK-PKNBQFBNSA-N
Data  2 IC50
  Tab Delimited (TSV)   2D SDfile   Computed 3D by Vconf -m prep SDfile
Find this compound or compounds like it in BindingDB:
Activity Spreadsheet -- Enzyme Inhibition Constant Data from BindingDB
Found 2 hits for monomerid = 46701
TargetMannose-6-phosphate isomerase(Homo sapiens (Human))
Burnham Center For Chemical Genomics
Curated by PubChem BioAssay
LigandPNGBDBM46701((4-chlorodithiazol-5-ylidene)-(m-tolyl)amine | 4-c...)
Affinity DataIC50: >1.00E+5nM. Assay description: Data Source: Sanford-Burnham Center for Chemical Genomics (SBCCG) Source Affiliation: Sanford-Burnham Medical Research Institute (SBMRI, San Diego, C...
In DepthDetails PCBioAssay
TargetPhosphomannomutase 2(Homo sapiens (Human))
Burnham Center For Chemical Genomics
Curated by PubChem BioAssay
LigandPNGBDBM46701((4-chlorodithiazol-5-ylidene)-(m-tolyl)amine | 4-c...)
Affinity DataIC50: >1.00E+5nM. Assay description: Data Source: Sanford-Burnham Center for Chemical Genomics (SBCCG) Source Affiliation: Sanford-Burnham Medical Research Institute (SBMRI, San Diego, C...
In DepthDetails PCBioAssay