BDBM46708 2-(4-tert-butylphenyl)-1,2-benzothiazol-3-one::MLS-0390897.0001::cid_25181217
SMILES CC(C)(C)c1ccc(cc1)-n1sc2ccccc2c1=O
InChI Key InChIKey=LSWCOOVGYNLMFY-UHFFFAOYSA-N
Data  3 IC50
  Tab Delimited (TSV)   2D SDfile   Computed 3D by Vconf -m prep SDfile
Find this compound or compounds like it in BindingDB:
Activity Spreadsheet -- Enzyme Inhibition Constant Data from BindingDB
Found 3 hits for monomerid = 46708
TargetPhosphomannomutase 2(Homo sapiens (Human))
Burnham Center For Chemical Genomics
Curated by PubChem BioAssay
LigandPNGBDBM46708(2-(4-tert-butylphenyl)-1,2-benzothiazol-3-one | ML...)
Affinity DataIC50:  8.25E+4nM. Assay description: Data Source: Sanford-Burnham Center for Chemical Genomics (SBCCG) Source Affiliation: Sanford-Burnham Medical Research Institute (SBMRI, San Diego, C...
In DepthDetails PCBioAssay
TargetMannose-6-phosphate isomerase(Homo sapiens (Human))
Burnham Center For Chemical Genomics
Curated by PubChem BioAssay
LigandPNGBDBM46708(2-(4-tert-butylphenyl)-1,2-benzothiazol-3-one | ML...)
Affinity DataIC50:  3.76E+4nM. Assay description: Data Source: Sanford-Burnham Center for Chemical Genomics (SBCCG) Source Affiliation: Sanford-Burnham Medical Research Institute (SBMRI, San Diego, C...
In DepthDetails PCBioAssay
TargetPhosphoethanolamine/phosphocholine phosphatase(Homo sapiens (Human))
Burnham Center For Chemical Genomics
Curated by PubChem BioAssay
LigandPNGBDBM46708(2-(4-tert-butylphenyl)-1,2-benzothiazol-3-one | ML...)
Affinity DataIC50:  5.43E+4nM. Assay description: Data Source: Sanford-Burnham Center for Chemical Genomics (SBCCG) Source Affiliation: Sanford-Burnham Medical Research Institute (SBMRI, San Diego, C...
In DepthDetails PCBioAssay