BDBM467247 (R)-4-(3-(1-acryloylpyrrolidin-3-yl)-7-amino-4- oxo-4,5-dihydro-1H-pyrazolo[3,4-d]pyridazin-1- yl)-N-(pyridin-2-yl)benzamide::US10800785, Example 90
SMILES Nc1n[nH]c(=O)c2c(nn(-c3ccc(cc3)C(=O)Nc3ccccn3)c12)[C@@H]1CCN(C1)C(=O)C=C
InChI Key InChIKey=ZDSWPMCQXVSSFG-OAHLLOKOSA-N
Data  1 IC50
  Tab Delimited (TSV)   2D SDfile   Computed 3D by Vconf -m prep SDfile
Find this compound or compounds like it in BindingDB:
Activity Spreadsheet -- Enzyme Inhibition Constant Data from BindingDB
Found 1 hit for monomerid = 467247
TargetTyrosine-protein kinase BTK(Homo sapiens (Human))
Shanghai Fochon Pharmaceutical
US Patent
LigandPNGBDBM467247((R)-4-(3-(1-acryloylpyrrolidin-3-yl)-7-amino-4- ox...)
Affinity DataIC50:  580nM. Assay description: MTS testing kit was purchased from Promega. The DMEM, Fetal bovine serum and Penicillin-Streptomycin were purchased from Gibco. Dimethyl sulfoxide (D...
Ligand InfoPC cidPC sid
In DepthDetails US Patent