BDBM467317 US10800786, Example 1.00
SMILES CC(C)(C)C(=O)Nc1cc(cnc1COC(=O)N1CC2=C(C1)CN(C2)C(=O)[C@@H]1CCc2[nH]nnc2C1)C(F)(F)F
InChI Key
Data  1 IC50
  Tab Delimited (TSV)   2D SDfile   Computed 3D by Vconf -m prep SDfile
Find this compound or compounds like it in BindingDB:
Activity Spreadsheet -- Enzyme Inhibition Constant Data from BindingDB
Found 1 hit for monomerid = 467317
TargetAtaxin-1(Homo sapiens (Human))
Hoffmann-La Roche
US Patent
LigandPNGBDBM467317(US10800786, Example 1.00)
Affinity DataIC50:  7nM. Assay description: ATX inhibition was measured by a fluorescence quenching assay using a specifically labeled substrate analogue (MR121 substrate). To obtain this MR121...
Ligand InfoPC cidPC sid
In DepthDetails US Patent