BDBM467820 N-((3R,5R)-1-Acryloyl-5-methoxypiperidin-3-yl)-5-(*S)-(2-methyl- 4-phenoxyphenyl)-4-oxo-4,5-dihydro-3H-1-thia-3,5,8- triazaacenaphthylene-2-carboxamide;::US10800792, Example 481::US10822348, Example 481
SMILES CO[C@@H]1C[C@H](CN(C1)C(=O)C=C)NC(=O)c1sc2nccc3n(-c4ccc(Oc5ccccc5)cc4C)c(=O)[nH]c1c23
InChI Key
Data  2 IC50
  Tab Delimited (TSV)   2D SDfile   Computed 3D by Vconf -m prep SDfile
Find this compound or compounds like it in BindingDB:
Activity Spreadsheet -- Enzyme Inhibition Constant Data from BindingDB
Found 2 hits for monomerid = 467820
TargetTyrosine-protein kinase BTK(Homo sapiens (Human))
Janssen Pharmaceutica
US Patent
LigandPNGBDBM467820(N-((3R,5R)-1-Acryloyl-5-methoxypiperidin-3-yl)-5-(...)
Affinity DataIC50:  6.31nM. Assay description: TBD
Ligand InfoPC cidPC sid
In DepthDetails US Patent
TargetTyrosine-protein kinase BTK [386-659](Homo sapiens (Human))
Janssen Pharmaceutica
US Patent
LigandPNGBDBM467820(N-((3R,5R)-1-Acryloyl-5-methoxypiperidin-3-yl)-5-(...)
Affinity DataIC50:  6.31nM. Assay description: A BTK kinase lanthascreen binding assay monitors compound binding to unphosphorylated-BTK kinase domain (UP-BTK), by competing with a fluorescent lab...
Ligand InfoPC cidPC sid
In DepthDetails US Patent