BDBM46808 (5E)-5-(4-hydroxybenzylidene)-3-[(4-ketocyclohexa-2,5-dien-1-ylidene)methylamino]-2-thioxo-thiazolidin-4-one::(5E)-5-[(4-hydroxyphenyl)methylidene]-3-[(4-oxidanylidenecyclohexa-2,5-dien-1-ylidene)methylamino]-2-sulfanylidene-1,3-thiazolidin-4-one::(5E)-5-[(4-hydroxyphenyl)methylidene]-3-[(4-oxo-1-cyclohexa-2,5-dienylidene)methylamino]-2-sulfanylidene-4-thiazolidinone::(5E)-5-[(4-hydroxyphenyl)methylidene]-3-[(4-oxocyclohexa-2,5-dien-1-ylidene)methylamino]-2-sulfanylidene-1,3-thiazolidin-4-one::5-[1-(4-Hydroxy-phenyl)-meth-(E)-ylidene]-3-{[1-(4-hydroxy-phenyl)-meth-(E)-ylidene]-amino}-2-thioxo-th iazolidin-4-one::MLS000777147::SMR000413543::cid_5520991
SMILES Oc1ccc(C=NN2C(=S)SC(=Cc3ccc(O)cc3)C2=O)cc1
InChI Key InChIKey=FWENLZVISCLCNP-UHFFFAOYSA-N
Data  1 IC50  2 EC50
  Tab Delimited (TSV)   2D SDfile   Computed 3D by Vconf -m prep SDfile
Find this compound or compounds like it in BindingDB:
Activity Spreadsheet -- Enzyme Inhibition Constant Data from BindingDB
Found 3 hits for monomerid = 46808
TargetIon channel NompC(Danio rerio)
The Scripps Research Institute Molecular Screening Center
Curated by PubChem BioAssay
LigandPNGBDBM46808((5E)-5-(4-hydroxybenzylidene)-3-[(4-ketocyclohexa-...)
Affinity DataEC50:  4.90E+3nM. Assay description: Source (MLPCN Center Name): The Scripps Research Institute Molecular Screening Center (SRIMSC) Center Affiliation: The Scripps Research Institute (TS...
In DepthDetails PCBioAssay
TargetInduced myeloid leukemia cell differentiation protein Mcl-1(Homo sapiens (Human))
Emory University
Curated by PubChem BioAssay
LigandPNGBDBM46808((5E)-5-(4-hydroxybenzylidene)-3-[(4-ketocyclohexa-...)
Affinity DataIC50:  2.48E+3nM. Assay description: NIH Molecular Libraries Screening Centers Network [MLSCN] Emory Chemical Biology Discovery Center in MLSCN Assay provider: Nikolovska-Coleska, Univer...
In DepthDetails PCBioAssay
TargetMucolipin-3(Homo sapiens (Human))
The Scripps Research Institute Molecular Screening Center
Curated by PubChem BioAssay
LigandPNGBDBM46808((5E)-5-(4-hydroxybenzylidene)-3-[(4-ketocyclohexa-...)
Affinity DataEC50:  2.99E+4nM. Assay description: Source (MLPCN Center Name): The Scripps Research Institute Molecular Screening Center (SRIMSC) Center Affiliation: The Scripps Research Institute (TS...
In DepthDetails PCBioAssay