BDBM468124 (R)-N-(1-Acryloylpiperidin-3-yl)-5-(*S)-(6-isopropoxy-4- methylpyridin-3-yl)-4-oxo-4,5-dihydro-3H-1-thia-3,5,8- triazaacenaphthylene-2-carboxamide;::US10800792, Example 789::US10822348, Example 804
SMILES CC(C)Oc1cc(C)c(cn1)-n1c2ccnc3sc(C(=O)N[C@@H]4CCCN(C4)C(=O)C=C)c([nH]c1=O)c23
InChI Key
Data  1 KI  2 IC50
  Tab Delimited (TSV)   2D SDfile   Computed 3D by Vconf -m prep SDfile
Find this compound or compounds like it in BindingDB:
Activity Spreadsheet -- Enzyme Inhibition Constant Data from BindingDB
Found 3 hits for monomerid = 468124
TargetTyrosine-protein kinase BTK(Homo sapiens (Human))
Janssen Research & Development
Curated by ChEMBL
LigandPNGBDBM468124((R)-N-(1-Acryloylpiperidin-3-yl)-5-(*S)-(6-isoprop...)
Affinity DataKi:  208nM. Assay description: Inhibition of full length N-terminal GST-tagged human BTK expressed in Sf21 cells assessed as inhibition constant using NH2-KKKAPFSWYLPEEG as substra...
Ligand InfoPC cidPC sid
In DepthDetails PubMed
TargetTyrosine-protein kinase BTK(Homo sapiens (Human))
Janssen Research & Development
Curated by ChEMBL
LigandPNGBDBM468124((R)-N-(1-Acryloylpiperidin-3-yl)-5-(*S)-(6-isoprop...)
Affinity DataIC50:  7.94nM. Assay description: TBD
Ligand InfoPC cidPC sid
In DepthDetails US Patent
TargetTyrosine-protein kinase BTK [386-659](Homo sapiens (Human))
Janssen Pharmaceutica
US Patent
LigandPNGBDBM468124((R)-N-(1-Acryloylpiperidin-3-yl)-5-(*S)-(6-isoprop...)
Affinity DataIC50:  794nM. Assay description: A BTK kinase lanthascreen binding assay monitors compound binding to unphosphorylated-BTK kinase domain (UP-BTK), by competing with a fluorescent lab...
Ligand InfoPC cidPC sid
In DepthDetails US Patent