BDBM468159 (R)-5-(*S)-(2-Methyl-4-phenoxyphenyl)-4-oxo-N-(1- (vinylsulfonyl)pyrrolidin-3-yl)-4,5-dihydro-3H-1-thia-3,5,8- triazaacenaphthylene-2-carboxamide;::US10800792, Example 834
SMILES Cc1cc(Oc2ccccc2)ccc1-n1c2ccnc3sc(C(=O)N[C@@H]4CCN(C4)S(=O)(=O)C=C)c([nH]c1=O)c23
InChI Key
Data  1 IC50
  Tab Delimited (TSV)   2D SDfile   Computed 3D by Vconf -m prep SDfile
Find this compound or compounds like it in BindingDB:
Activity Spreadsheet -- Enzyme Inhibition Constant Data from BindingDB
Found 1 hit for monomerid = 468159
TargetTyrosine-protein kinase BTK(Homo sapiens (Human))
Janssen Pharmaceutica
US Patent
LigandPNGBDBM468159((R)-5-(*S)-(2-Methyl-4-phenoxyphenyl)-4-oxo-N-(1- ...)
Affinity DataIC50:  10nM. Assay description: TBD
Ligand InfoPC cidPC sid
In DepthDetails US Patent