BDBM468301 US10806794, Compound di-mPEG5-Atazanavir
SMILES COCCOCCOCCOCCOCCOC(=O)N[C@@H](C(=O)NC(Cc1ccccc1)[C@@H](O)CN(Cc1ccc(cc1)-c1ccccn1)NC(=O)[C@H](NC(=O)OCCOCCOCCOCCOCCOC)C(C)(C)C)C(C)(C)C
InChI Key InChIKey=UMJKGBYERWVCJI-UIGSGOMUSA-N
Data  1 IC50
  Tab Delimited (TSV)   2D SDfile   Computed 3D by Vconf -m prep SDfile
Find this compound or compounds like it in BindingDB:
Activity Spreadsheet -- Enzyme Inhibition Constant Data from BindingDB
Found 1 hit for monomerid = 468301
TargetHIV-1 protease(Human immunodeficiency virus)
Nektar Therapeutics
US Patent
LigandPNGBDBM468301(US10806794, Compound di-mPEG5-Atazanavir)
Affinity DataIC50:  17.3nM. Assay description: Protease inhibitors (PI) are used to treat HIV infection by preventing viral assembly and maturation through the inhibition of HIV-1 protease activit...
Ligand InfoPC cidPC sid
In DepthDetails US Patent