BDBM468370 US10806794, Compound mono-mPEG5-Atazanavir
SMILES COCCOCCOCCOCCOCCOC(=O)NC(C(=O)NC(Cc1ccccc1)C(O)CN(Cc1ccc(cc1)-c1ccccn1)NC(=O)C(NC(=O)OC)C(C)(C)C)C(C)(C)C
InChI Key InChIKey=LAMBNJDHUCBNCS-UHFFFAOYSA-N
Data  1 IC50
  Tab Delimited (TSV)   2D SDfile   Computed 3D by Vconf -m prep SDfile
Find this compound or compounds like it in BindingDB:
Activity Spreadsheet -- Enzyme Inhibition Constant Data from BindingDB
Found 1 hit for monomerid = 468370
TargetHIV-1 protease(Human immunodeficiency virus)
Nektar Therapeutics
US Patent
LigandPNGBDBM468370(US10806794, Compound mono-mPEG5-Atazanavir)
Affinity DataIC50:  2.91nM. Assay description: Protease inhibitors (PI) are used to treat HIV infection by preventing viral assembly and maturation through the inhibition of HIV-1 protease activit...
Ligand InfoPC cidPC sid
In DepthDetails US Patent