BDBM468480 US10806785, Example 120-1
SMILES CN1CCc2c(C1)nc(C(=O)Nc1cccc(c1C)-c1cccc(NC(=O)c3nc4CN(CC5CC[C@](C)(CC5)C(O)=O)CCc4n3C)c1Cl)n2C
InChI Key InChIKey=ZFVWUXUTNVNKEF-HPELJNNTSA-N
Data  1 IC50
  Tab Delimited (TSV)   2D SDfile   Computed 3D by Vconf -m prep SDfile
Find this compound or compounds like it in BindingDB:
Activity Spreadsheet -- Enzyme Inhibition Constant Data from BindingDB
Found 1 hit for monomerid = 468480
TargetProgrammed cell death 1 ligand 1 [19-238]/protein 1 [25-167](Homo sapiens (Human))
Incyte
US Patent
LigandPNGBDBM468480(US10806785, Example 120-1)
Affinity DataIC50: <0.100nM. Assay description: The assays were conducted in a standard black 384-well polystyrene plate with a final volume of 20 μL. Inhibitors were first serially diluted in...
Ligand InfoPC cidPC sid
In DepthDetails US Patent