BDBM468582 US10807944, Compound RLS2-187::US11731934, Compound RLS2-187
SMILES Cc1ccc(cc1)C(=O)NNC(C)(C)C
InChI Key InChIKey=BNQKRKDIMONCAS-UHFFFAOYSA-N
Data  6 IC50
  Tab Delimited (TSV)   2D SDfile   Computed 3D by Vconf -m prep SDfile
Find this compound or compounds like it in BindingDB:
Activity Spreadsheet -- Enzyme Inhibition Constant Data from BindingDB
Found 6 hits for monomerid = 468582
TargetHistone deacetylase 1(Homo sapiens (Human))
University Of Florida Research Foundation
US Patent
LigandPNGBDBM468582(US10807944, Compound RLS2-187 | US11731934, Compou...)
Affinity DataIC50: >5.00E+4nM. Assay description: These SAR data indicate that a tripartite structure of this scaffold with a central —C(O)—NH—NH— unit flanked by a phenyl group and a short aliphatic...
Ligand InfoPC cidPC sid
In DepthDetails US Patent
TargetHistone deacetylase 2(Homo sapiens (Human))
University Of Florida Research Foundation
US Patent
LigandPNGBDBM468582(US10807944, Compound RLS2-187 | US11731934, Compou...)
Affinity DataIC50: >5.00E+4nM. Assay description: These SAR data indicate that a tripartite structure of this scaffold with a central —C(O)—NH—NH— unit flanked by a phenyl group and a short aliphatic...
Ligand InfoPC cidPC sid
In DepthDetails US Patent
TargetHistone deacetylase 3(Homo sapiens (Human))
University Of Florida Research Foundation
US Patent
LigandPNGBDBM468582(US10807944, Compound RLS2-187 | US11731934, Compou...)
Affinity DataIC50: >5.00E+4nM
Ligand InfoPC cidPC sid
In DepthDetails US Patent
TargetHistone deacetylase 1(Homo sapiens (Human))
University Of Florida Research Foundation
US Patent
LigandPNGBDBM468582(US10807944, Compound RLS2-187 | US11731934, Compou...)
Affinity DataIC50: >5.00E+4nM. Assay description: These SAR data indicate that a tripartite structure of this scaffold with a central C(O) NH NH unit flanked by a phenyl group and a short aliphatic c...
Ligand InfoPC cidPC sid
In DepthDetails US Patent
TargetHistone deacetylase 2(Homo sapiens (Human))
University Of Florida Research Foundation
US Patent
LigandPNGBDBM468582(US10807944, Compound RLS2-187 | US11731934, Compou...)
Affinity DataIC50: >5.00E+4nM
Ligand InfoPC cidPC sid
In DepthDetails US Patent
TargetHistone deacetylase 3(Homo sapiens (Human))
University Of Florida Research Foundation
US Patent
LigandPNGBDBM468582(US10807944, Compound RLS2-187 | US11731934, Compou...)
Affinity DataIC50: >5.00E+4nM. Assay description: These SAR data indicate that a tripartite structure of this scaffold with a central —C(O)—NH—NH— unit flanked by a phenyl group and a short aliphatic...
Ligand InfoPC cidPC sid
In DepthDetails US Patent